Import Debian version 2020.06

base-files (1:2020.06) rolling; urgency=medium

  * Bump Parrot 4.10 version.
  * Update motd.
4 jobs for debian/2020.06 in 22 minutes and 47 seconds (queued for 238 minutes and 31 seconds)
latest
Status Job ID Name Coverage
  Test Source
passed test-source-lts #1869

00:01:05

passed test-source-rolling #1870

00:10:13

 
  Build
failed lintian-lts #1871

00:01:10

failed lintian-rolling #1872

00:10:18

 
Name Stage Failure
failed
lintian-rolling Build
sed -e "s&#OSNAME#&"GNU/`uname | sed -e 's/GNU\///'`"&g" share/motd     > debian/base-files/usr/share/base-files/motd
sed: can't read share/motd: No such file or directory
make[1]: *** [debian/rules:29: override_dh_auto_install] Error 2
make[1]: Leaving directory '/builds/packages/debian/base-files'
make: *** [debian/rules:15: binary] Error 2
dpkg-buildpackage: error: debian/rules binary subprocess returned exit status 2
debuild: fatal error at line 1182:
dpkg-buildpackage -us -uc -ui -b -d failed
ERROR: Job failed: exit code 1
failed
lintian-lts Build
sed -e "s&#OSNAME#&"GNU/`uname | sed -e 's/GNU\///'`"&g" share/motd     > debian/base-files/usr/share/base-files/motd
sed: can't read share/motd: No such file or directory
make[1]: *** [debian/rules:29: override_dh_auto_install] Error 2
make[1]: Leaving directory '/builds/packages/debian/base-files'
make: *** [debian/rules:15: binary] Error 2
dpkg-buildpackage: error: debian/rules binary subprocess returned exit status 2
debuild: fatal error at line 1182:
dpkg-buildpackage -us -uc -ui -b -d failed
ERROR: Job failed: exit code 1