Upload project

4 jobs for upstream/2.0.0 in 3 minutes and 4 seconds (queued for 1 second)
latest
Status Name Job ID Coverage
  Test Source
passed test-source-lts #681

00:01:03

passed test-source-rolling #682

00:00:33

 
  Build
failed lintian-lts #683

00:01:05

failed lintian-rolling #684

00:01:59

 
Name Stage Failure
failed
lintian-rolling Build
	/root/go/src/gopkg.in/cheggaaa/pb.v1 (from $GOPATH)
make[1]: *** [Makefile:6: install] Error 1
make[1]: Leaving directory '/builds/packages/tools/amber-packer'
dh_auto_install: error: make -j4 install DESTDIR=/builds/packages/tools/amber-packer/debian/amber-packer AM_UPDATE_INFO_DIR=no "INSTALL=install --strip-program=true" returned exit code 2
make: *** [debian/rules:18: binary] Error 25
dpkg-buildpackage: error: debian/rules binary subprocess returned exit status 2
debuild: fatal error at line 1182:
dpkg-buildpackage -us -uc -ui -b -d failed
ERROR: Job failed: exit code 1
failed
lintian-lts Build
After this operation, 66.6 kB of additional disk space will be used.
Err:2 https://deb.parrot.sh/parrot lts/main amd64 golang amd64 2:1.11~1
404 Not Found [IP: 104.27.131.193 443]
Get:1 https://parrot.mirror.cythin.com/parrot lts/main amd64 golang-1.11 all 1.11.6-1+deb10u3 [24.0 kB]
E: Failed to fetch https://deb.parrot.sh/parrot/pool/main/g/golang-defaults/golang_1.11~1_amd64.deb 404 Not Found [IP: 104.27.131.193 443]
E: Unable to fetch some archives, maybe run apt-get update or try with --fix-missing?
E: Failed to process build dependencies
Fetched 24.0 kB in 4s (6682 B/s)
ERROR: Job failed: exit code 1